{"text_format":"2","workbook":"xlsx","n_sheets":8,"sheets":["정산","상품별정산내역조회","정산확정조회","미수금 메뉴","기타차감 메뉴","배송비 메뉴","정산서(참고)","SCM"],"not_rendered":{"charts":0,"images":8,"macros":0,"external_links":1,"defined_names":0,"comments":0,"pivot_tables":0},"unopened":[],"bounds":{"document_bytes":16777216,"sheet_cells":100000,"run_cost":"one","rows_first":2000,"rows_last":500,"rows_between":2000,"halvings":0,"cell_chars":16384,"cell_head_chars":4096},"cells_cut":0,"cells_raw":0,"read":"whole","date_system":"1900"}

{"sheet":"정산","index":0,"n_rows":32,"n_cols":20,"rows_kept":32,"cut":false,"hidden":false,"merged":[]}
[]
[]
[null,"현, 정산 시 사용 메뉴"]
[]
[{"$nulls":13},"상품정산"]
[{"$nulls":13},"배송비정산"]
[{"$nulls":13},"정산확정관리"]
[{"$nulls":13},"업체별정산"]
[{"$nulls":13},"PG입금정산(추가. TID기준으로 주문데이터랑 비교)"]
[]
[]
[]
[]
[]
[null,"① 배송비 정산내역 조회 / 배송비 정산확정 조회 -> vendorname 으로도 조회 가능하도록"]
[null,"② 상품별정산내역조회 -> 정산예정등록 -> 정산확정 -> 정산완료조회 -> [상품별정산내역조회 -> 정산완료조회] 로 과정 단순화 필요"]
[null,"③ 실제 계산서 발행 금액 조회 가능하도록"]
[null,"④ 엑셀 피벗 등 수기로 만들 던 정산서 및 결제리스트 엑셀로 다운 가능하도록"]
[null,"⑤ 엑셀 / 수기로 관리되는 기타차감 / 미수금 내역을 SCM 안에서 정확하게 관리되도록"]
[null,"⑥ 수기로 작성되던 업체별 지급리스트를 바로 다운 가능하도록"]
[]
[]
[null,"협력사 등록 시 계좌정보 세분화 및 계산서 email / 전자계약 여부 체크"]
[]
[{"$nulls":19},"<추가요청 사항>"]
[]
[{"$nulls":19},"① 공급처 등록에 등록하던 은행계좌정보를 [협력사 등록] 등록하도록!(필수)"]
[{"$nulls":19},"-> 은행 / 계좌번호 / 예금주 세분화 등록"]
[]
[{"$nulls":19},"② [협력사 등록] 시, 계산서 발행 email 등록 필수"]
[]
[{"$nulls":19},"③ [협력사 등록] 시, 전자계약 여부 체크"]

{"sheet":"상품별정산내역조회","index":1,"n_rows":105,"n_cols":6,"rows_kept":105,"cut":false,"hidden":false,"merged":[]}
[null,"* 정산마감관리 화면 필요 (확정/해제 기능 필요). 조회결과의 항목 값들을 리스트 형태로 표출해 주고. 정산담당자 권한을 분리해서 \"정산관리자\" 추가. 확정 시 \"전자계약여부\" 저장해야 함"]
[null,"1. 상품별 정산내역 조회"]
[]
[null,"1-1. 상품별 정산내역 조회 화면 구성요청"]
[null,"정산 raw 파일을 다운 받는 메뉴."]
[null,"기존에는 [정산예정등록] -> [정산확정] 메뉴에서 각각 정산 예정 등록 및 정산 확정 처리 필요."]
[null,"이후에는 raw 파일 다운 받는 메뉴에서(현 상품별정산내역조회) 정산 확정처리까지 가능토록."]
{"$rows_empty":23}
[null,"* 검색조건: 출고기간, 공급업체/브랜드, 유통구분, 정산주기(15일정산/월말정산)"]
[]
[null,"① Vendorname 별로도 조회 가능토록, [협력사 별 조회] 추가"]
[null,": ex) [한세드림]으로 조회 -> vendorname 한세드림으로 등록된 모든 내역 조회 / 하단 요약 내용 조회"]
[]
[null,"② 세금계산서 발행금액(VAT포함) -> 수식 변경 : =round( 수수료 - 자사쿠폰분담액 , 0)"]
[]
[null,"③ 현재의 [상품별정산내역조회] 에서 바로 [정산확정] 처리 가능하도록."]
[null,": 정산 기준일자 체크 후, 정산확정 처리 가능토록."]
[null,": 기존에는 발급상태 -> 정산대기상태 -> 정산완료 / 변경 이후에는 발급상태 -> 정산완료"]
[]
[]
[]
[]
[null,"1-2. 상품별 정산내역 조회 raw파일"]
[]
[null,"상품별정산내역조회"]
[null,"항목","값",null,null,"추가 or 수정"]
[null,"SettlementNo",61855163]
[null,"OrderNo",19217971,"온라인주문번호"]
[null,"OrderGUID","f2b1f0ac-2629-4ea3-8f36-e5a692fa826b"]
[null,"CustomerName","김연홍"]
[null,"VendorNo",2548,"협력사번호"]
[null,"VendorName","(주) 패션포유","협력사명"]
[null,"ProviderNo",2839,"공급처번호(공급업체코드)"]
[null,"ProviderName","(주) 패션포유","공급처명"]
[null,"DeliveryUnitNo",7254,"출고처번호"]
[null,"DeliveryUnitName","(주)패션포유_BNP","출고처명"]
[null,"DistributionCd","입점","유통구분(입점-위탁)"]
[null,"SettleTypeCd","월말정산","정산주기"]
[null,"DateSales","2020-09-01T08:58:31.76+09:00","주문일시"]
[null,"IssueTypeCd","정상","결제/취소(판매구분:판매/환입(취소/품절취소/반품/교환)"]
[null,"ProductNo",15540069,"상품번호"]
[null,"ProductCode",14163793,"상품코드"]
[null,"ProductName","[지오지아] 마이크로 패턴 슬랙스 팬츠 I (ABY2PP1102)","상품명"]
[null,"BrandName","ZIOZIA","브랜드명"]
[null,"FirstCategoryName","남성패션/슈즈","카테고리 -> 담당MD로 변경"]
[null,"SKUCode","14163793-6","단품코드"]
[null,"SKUValue","GR/88","사이즈코드"]
[null,"ModelNo","ABY2PP1102"]
[null,"판매가격",19900,"현재판매가"]
[null,"수량",1,"수량"]
[null,"판매총액",19900,"현재판매가*수량"]
[null,"쿠폰할인총액",0,"쿠폰사용금액(즉시사용쿠폰금액+상품쿠폰금액+주문서쿠폰금액)"]
[null,null,null,"즉시사용쿠폰금액"]
[null,null,null,"상품쿠폰금액"]
[null,null,null,"주문서쿠폰금액"]
[null,null,null,"포인트사용금액"]
[null,null,null,"다다익선할인금액"]
[null,"자사쿠폰분담액",0,"자사쿠폰분담액"]
[null,"협력사쿠폰분담액",0,"업체쿠폰분담액"]
[null,"실판매가격",19900,"실판매금액(쿠폰, 다다익선만 차감): 상품권 포함, 포인트 포함"]
[null,"상품총액",19900,"실판매금액 * 수량"]
[null,"Enuri",0]
[null,"Allotment",0]
[null,"PointSubTotal",787]
[null,"수수료율","=수수료/판매총액","판매수수료율"]
[null,"수수료",2786,"round(판매총액 * 판매수수료율,0)"]
[null,"정산대상액",17114,"상품총액 - 수수료 + 자사쿠폰분담액"]
[null,"계산서 발행 합계액=a","=round( 수수료-자사쿠폰분담액 , 0 ) ( < 0 인 경우, 0으로 표기)"]
[null,"계산서 발행 공급가액=c","=int(a/1.1)","round(a/1.1)"]
[null,"계산서 발행 세액=b","=a-c"]
[null,"MarginSurTax",253.27272730000001]
[null,"Amount",17114]
[null,"SaleStatusCd","매출확정"]
[null,"SettleStatusCd","발급"]
[null,"SettleDate"]
[null,"CategoryPath","남성패션/슈즈|팬츠|캐주얼 팬츠|면바지"]
[null,"ChannelCd","mist_ios"]
[null,"PartnerPrice","개발완료","샵링커를 통해 받을 수 있는지 확인? (제공 안 되면 수기 관리해야 함)"]
[null,"IFOrderNo","개발완료","제휴몰주문번호"]
[null,"판매가-제휴가","개발완료"]
{"$rows_left_out":4}
{"sheet":"정산확정조회","index":2,"n_rows":128,"n_cols":7,"rows_kept":128,"cut":false,"hidden":false,"merged":[]}
[]
[null,"2. 정산확정 조회(현 메뉴 이름 정산완료조회)"]
[]
[null,"현재 메뉴 이름 [정산완료조회] -> [정산확정조회]로 화면과 통일되도록 필요."]
[null,"2-1. 정산확정 조회 화면 구성요청"]
{"$rows_empty":22}
[null,"① Vendorname 별로도 조회 가능토록, [협력사 별 조회] 추가"]
[null,": ex) [한세드림]으로 조회 -> vendorname 한세드림으로 등록된 모든 내역 조회 / 하단 요약 내용 조회"]
[]
[null,"② 세금계산서 발행금액(VAT포함) -> 수식 변경 : = round(수수료-자사분담액, 0) "]
[]
[null,"③ 공급가 총액 -> 수식 변경 : = int(A/1.1) "]
[]
[null,"④ 세액 총액 -> 수식 변경 : = A - B"]
[]
[null,"⑤ [정산서 다운] 메뉴 생성 -> 정산서(참고) sheet 추가하였습니다."]
[]
[null,"⑥ 미수금 및 기타차감 금액 요약 표시"]
[]
[]
[]
[null,"2-2. 정산확정 조회 raw파일(세금계산서용 엑셀다운로드(추가버전)"]
[]
[null,"정산확정조회 -> 세금계산서용 엑셀다운로드(추가버전): 노란색 부분만 출력되면 됨)."]
[null,"항목","값","수식수정",null,null,"추가 or 수정"]
[null,"작업종류","11"]
[null,"역발행여부","F"]
[null,"작성일","2020-09-30",null,"월말기준"]
[null,"총공급가액",4136]
[null,"총세액",414]
[null,"거래항목시작","S"]
[null,"거래일자","09-30"]
[null,"품목","상품판매 수수료",null,"고정값"]
[null,"규격",""]
[null,"수량",""]
[null,"단가",""]
[null,"공급가액",4136,"=int(현금거래액/1.1)","ROUND(현금거래액/1.1)"]
[null,"세액",414,"=현금거래액-공급가액"]
[null,"거래항목종료","E"]
[null,"현금거래액",4550,"=round( 수수료-자사쿠폰분담액 , 0 ) ( < 0 인 경우, 0으로 표기)"]
[null,"수표거래액",""]
[null,"어음거래액",""]
[null,"외상미수금",""]
[null,"영수/청구",1]
[null,"세율",0]
[null,"공급자아이디","S"]
[null,"아이디",""]
[null,"공급자","1168132499"]
[null,"공급상호","아이스타일이십사주식회사"]
[null,"공급대표자명","김기호"]
[null,"공급업태","도소매업 소매업"]
[null,"공급업종","기타직물 전자상거래"]
[null,"공급자주소","서울 영등포구 여의도동"]
[null,"공급자상세주소","15-11 금영빌딩 5층"]
[null,"공급담당자","조정상"]
[null,"공급자부서","경영지원팀"]
[null,"공급자전화번호","02-3270-7622"]
[null,"공급자이메일","jscho@istyle24.com"]
[null,"공급받는자 아이디 구분",""]
[null,"아이디1",""]
[null,"공급받는자 사업자 등록번호","1388129408"]
[null,"상호","주식회사 트랜드이십일"]
[null,"대표자명","이해균"]
[null,"업태","도매"]
[null,"업종","의류"]
[null,"주소","경기도 하남시 항동"]
[null,"상세주소","경기도 하남시 항동"]
[null,"담당자","이근용",null,"정산담당자"]
[null,"부서",""]
[null,"전화번호","010-9213-7854",null,"정산담당자연락처"]
[null,"이메일","444ask@naver.com","협력사 등록 시 등록한 [계산서email] 값"]
[null,"문서번호","1168132499_20200930_1"]
[null,"비고","상품판매액 35000.00"]
[null,"세금계산서발행금액",4550,"=round( 수수료-자사쿠폰분담액 , 0 ) ( < 0 인 경우, 0으로 표기)"]
{"$rows_empty":7}
[null,"2-3. 정산서 다운 raw파일 (새로 생성) => 업체별정산 화면: 정산확정 시 \"공급업체의 전자계약여부\" 저장해야 함. 엑셀다운로드 필요함"]
[]
[null,"항목","값","수식(참고)"]
[null,"업체명","vendorname"]
[null,"전자계약","조회 일시 기준, 협력사 정보에 전자계약 체크내용"]
{"$rows_left_out":22}
{"sheet":"미수금 메뉴","index":3,"n_rows":63,"n_cols":10,"rows_kept":63,"cut":false,"hidden":false,"merged":[]}
[]
[null,"3. 미수금 메뉴 => 업체별정산 화면에서 처리하는 것으로 이 SHEET는 삭제"]
[]
[null,"3-1. 업체별 미수금 관리"]
[]
[]
[null,null,"메뉴구성"]
[]
[null,null,"협력사",null,"검색"]
[null,null,"사업자등록번호",null,"검색"]
[null,null,"발생 월",null,"검색"]
[]
[null,null,null,"조회",{"$nulls":4},"엑셀 업로드"]
[{"$nulls":8},"엑셀 다운로드"]
[null,null,"요약페이지-----------------------------------------------------------------------------------------"]
[]
[null,null,"협력사","사업자등록번호","발생 월","발생금액","회수 액","잔액"]
[{"$nulls":7},"발생금액-회수액"]
[]
[]
[]
[null,null,"하단 합계 표시------------------------------------------------------------------------------------"]
[null,null,"총 발생 금액 "]
[null,null,"총 회수액"]
[null,null,"총 잔액"]
[]
[]
[]
[]
[null,"① 업체별 미수금 엑셀 업로드 관리"]
[]
[null,"업체코드","총미수금액"]
[]
[]
[null,"위 양식으로 개발 이전까지 쌓여있던 미수금 잔액 업로드 / 입금으로 회수한 미수금액 업로드"]
[]
[]
[null,"② 업체별 정산금에서 차감된 미수금 -> 회수 월 / 회수 액에 업데이트"]
[]
[null,null,"ex)조회화면","협력사","사업자등록번호","발생 월","발생금액","회수 액","잔액"]
[null,null,null,"인터파크","222-22-22222","2018-05",5000,5000,{"$f":"+G41-H41","v":0}]
[null,null,null,"인터파크","222-22-22222","2019-06",7000,6000,{"$f":"+G42-H42","v":1000}]
[]
[{"$nulls":7},"-> 클릭 시, 회수 월 / 회수 금액 상세 확인 가능"]
[]
[{"$nulls":8},"회수 월 ","회수 금액"]
[{"$nulls":8},"2020-05",1000]
[{"$nulls":8},"2020-06",5000]
[]
[null,"③ 엑셀 다운로드 시"]
[]
[]
[null,"협력사","사업자등록번호","발생 월","발생금액","회수 월","회수 액","잔액"]
[null,"인터파크","222-22-22222","2018-05",5000,"2020-05",5000,{"$f":"+E54-G54","v":0}]
[null,"인터파크","222-22-22222","2019-06",7000,"2020-05",1000,{"$f":"+E55-G55","v":6000}]
[{"$nulls":5},"2020-06",5000,{"$f":"+H55-G56","v":1000}]
[]
[]
[]
[null,"④ [정산확정조회] 시 상태값 미수금 -> 데이터 연동"]
[]
[null,"협력사","사업자등록번호","발생 월","발생금액","회수 월","회수 액","잔액"]
[null,"인터파크","222-22-22222","정산 월","미수금 금액(총 지급금액)"]

{"sheet":"기타차감 메뉴","index":4,"n_rows":40,"n_cols":12,"rows_kept":40,"cut":false,"hidden":false,"merged":[]}
[]
[null,"4. 기타차감 메뉴 => 업체별정산 화면에서 처리하는 것으로 이 SHEET는 삭제"]
[]
[null,"4-1. 업체별 기타차감 관리 (CS팀에서 업로드 가능하도록)"]
[]
[]
[null,null,"메뉴구성"]
[]
[null,null,"협력사",null,"검색"]
[null,null,"사업자등록번호",null,"검색"]
[null,null,"발생 월",null,"검색"]
[]
[null,null,null,"조회"]
[{"$nulls":8},"엑셀 업로드"]
[null,null,"요약페이지-----------------------------------------------------------------------------------------"]
[]
[null,null,"협력사","사업자등록번호","발생월","주문번호","발생금액","사유"]
[null,null,"업체명","업체 정보에 있는 사업자등록번호 끌어오기","발생월","주문번호","보상액","텍스트"]
[{"$nulls":5},"-> 클릭시 상세 주문내용 확인"]
[]
[]
[null,null,"하단 합계 표시------------------------------------------------------------------------------------"]
[null,null,"조회 월"]
[null,null,"차감 금액"]
[]
[]
[]
[]
[]
[null,"① 업체별 기타차감 엑셀 업로드 관리"]
[]
[null,"ex) 고객만족팀에서 관리하는 기타차감 파일"]
[]
[null,"발생월","아이디","고객명","주문번호","카테고리","업체명","업체담당자","주문상품","상품가격","보상액","사유"]
[null,"2020-06","cresio","김미진",19019953,"여성","업체코드\n(주) 인터파크INT","임소영","[로엠] WY 셔츠형 베이직 블라우스 - RMBL738101_39 외 4건",37900,2500,"19019989 와 합포장 배송건이나 물류단위별로 배송료가 부과됨 \n과결제 배송비 2,500원 고객환불"]
[null,"2020-06","whitepotato","정지은",19018713,"여성","업체코드\n(주) 인터파크INT","임소영","[로엠] WY 스퀘어넥 블라우스 - RMBL738RQ5_39 외 5건",33000,2500,"합포장 배송건이나 물류 단위별로 배송료가 부과됨\n과결제 배송비 2,500원 고객환불"]
[null,"2020-06","whitepotato","정지은",19037826,"여성","업체코드\n(주) 인터파크INT","임소영","[머스트비] Y 어텀 팬츠 LMKFCPA509P 외 4건",33020,5000,"합포장 배송건이나 물류 단위별로 배송료가 부과됨\n무료배송 적용으로 5,000원 고객환불"]
[]
[]
[null,"위 양식으로 월별 / 업체별 보상액(기타차감액) 업로드"]

{"sheet":"배송비 메뉴","index":5,"n_rows":55,"n_cols":2,"rows_kept":55,"cut":false,"hidden":false,"merged":[]}
[]
[null,"5. 배송비정산내역조회 / 배송비정산확정조회"]
[]
[null,"Vendorname만으로도 조회 가능하도록"]
[]
[null,"배송비 정산내역조회"]
{"$rows_empty":22}
[null,"배송비 정산확정조회"]
{"$rows_empty":18}
[null,"① Vendorname 별로도 조회 가능토록, [협력사 별 조회] 추가"]
[null,": ex) [한세드림]으로 조회 -> vendorname 한세드림으로 등록된 모든 내역 조회 / 하단 요약 내용 조회"]
[]
[null,"* 하위 4개의 항목만 보여주면 됨"]
[null,"업체코드"]
[null,"업체명"]
[null,"유통구분"]
[null,"배송비금액"]

{"sheet":"정산서(참고)","index":6,"n_rows":131,"n_cols":18,"rows_kept":131,"cut":false,"hidden":false,"merged":[]}
[]
[]
[null,"엑셀 정산 시 완성하는 정산서(참고)"]
[]
[]
[]
[null,null,"2020년 9월 상품판매대금 및 배송비 정산 리스트-입점(YES24)"]
[null,null,"데이터출처 : "]
[null,null,"상품별정산내역조회-Vendorname","영업팀 전자계약완료 파일과 사업자번호 기준으로 vlookup",null,"상품별정산내역조회","상품별정산내역조회","상품별정산내역조회","배송배정산완료조회","회계장부 미수금","상품별정산내역조회","상품별정산내역조회","상품별정산내역조회","CS 수기차감 자료","정산확정조회-세금계산서용 엑셀다운로드(추가버전)","정산확정조회-세금계산서용 엑셀다운로드(추가버전)","정산확정조회-세금계산서용 엑셀다운로드(추가버전)"]
[null,"no","거  래  처","전자계약","사업자등록번호","판매수량","실판매매출(상품총액)","수 수 료(차감)","배 송 비","미수금회수","쿠폰사용금액","업체분담분","자사분담분","기타공제","계산서발행액","공급가액","세액","검산"]
[null,1,"(주) 솔트라이트아이엔씨",{"$f":"VLOOKUP(E11,[1]전자계약!A:B,2,FALSE)","v":"일괄 전자계약"},1208711710,1,15900,2385,null,null,0,0,0,null,{"$f":"ROUND(H11-M11,0)","v":2385},{"$f":"INT(O11/1.1)","v":2168},{"$f":"+O11-P11","v":217},{"$f":"ROUND(+G11+I11-J11-O11-N11,0)","v":13515}]
[null,2,"(주) 에스엠어페럴",{"$f":"VLOOKUP(E12,[1]전자계약!A:B,2,FALSE)","v":"일괄 전자계약"},1278652409,8,148000,22200,2500,null,0,0,0,null,{"$f":"ROUND(H12-M12,0)","v":22200},{"$f":"INT(O12/1.1)","v":20181},{"$f":"+O12-P12","v":2019},{"$f":"ROUND(+G12+I12-J12-O12-N12,0)","v":128300}]
[null,3,"(주) 에이치엔디컴퍼니",{"$f":"VLOOKUP(E13,[1]전자계약!A:B,2,FALSE)","v":"일괄 전자계약"},1278650769,2,27800,4170,null,null,0,0,0,null,4170,3790,380,23630]
[null,4,"(주) 엠케이트렌드_지알스토어",{"$f":"VLOOKUP(E14,[1]전자계약!A:B,2,FALSE)","v":"일괄 전자계약"},2038157509,0,-34100,-8184,null,null,0,0,0,null,-8184,-7440,-744,-25916]
[null,5,"(주) 엠케이트렌드",{"$f":"VLOOKUP(E15,[1]전자계약!A:B,2,FALSE)","v":"일괄 전자계약"},2038157509,18401,416993260,148985550,null,null,8679740,0,8679740,null,140305810,127550736,12755074,276687450]
[null,6,"(주) 와이아이씨컴퍼니",{"$f":"VLOOKUP(E16,[1]전자계약!A:B,2,FALSE)","v":"일괄 전자계약"},1208724665,179,4246935,575505,120000,null,179970,119569.70000000008,60400.299999999952,null,515105,468277,46828,3851830]
[null,7,"(주) 인터파크",{"$f":"VLOOKUP(E17,[1]전자계약!A:B,2,FALSE)","v":"일괄 전자계약"},2208147821,1799,23308452,2566664,957500,null,2358200,2360650,-2450,null,2569114,2335558,233556,21696838]
[null,8,"(주) 제이케이컴퍼니",{"$f":"VLOOKUP(E18,[1]전자계약!A:B,2,FALSE)","v":"일괄 전자계약"},6068193683,3,98400,14760,2500,null,0,0,0,null,14760,13418,1342,86140]
[null,9,"(주) 패션포유",{"$f":"VLOOKUP(E19,[1]전자계약!A:B,2,FALSE)","v":"일괄 전자계약"},2098159257,64,1034900,145394,55000,null,12900,12900,0,null,145394,132176,13218,944506]
[null,10,"(주) 피앤에프컴퍼니",{"$f":"VLOOKUP(E20,[1]전자계약!A:B,2,FALSE)","v":"일괄 전자계약"},2068643692,9,197890,36000,7500,null,2110,2110,0,null,36000,32727,3273,169390]
[null,11,"(주)SG세계물산",{"$f":"VLOOKUP(E21,[1]전자계약!A:B,2,FALSE)","v":"일괄 전자계약"},1198101073,277,2404000,310773,15000,null,0,0,0,null,310773,282520,28253,2108227]
[null,12,"(주)규",{"$f":"VLOOKUP(E22,[1]전자계약!A:B,2,FALSE)","v":"일괄 전자계약"},1818100517,1,30300,5454,2500,null,0,0,0,null,5454,4958,496,27346]
[null,13,"(주)대성아이엔지",{"$f":"VLOOKUP(E23,[1]전자계약!A:B,2,FALSE)","v":"일괄 전자계약"},1198623714,3,37300,9465,5000,null,0,0,0,null,9465,8604,861,32835]
[null,14,"(주)미래바이텍",{"$f":"VLOOKUP(E24,[1]전자계약!A:B,2,FALSE)","v":"일괄 전자계약"},1238138448,1,49000,9800,null,null,0,0,0,null,9800,8909,891,39200]
[null,15,"(주)비케이커머스",{"$f":"VLOOKUP(E25,[1]전자계약!A:B,2,FALSE)","v":"일괄 전자계약"},2048653404,8,270200,47650,null,null,0,0,0,null,47650,43318,4332,222550]
[null,16,"(주)빌리버스",{"$f":"VLOOKUP(E26,[1]전자계약!A:B,2,FALSE)","v":"일괄 전자계약"},1058708647,23,587000,117400,32500,null,0,0,0,null,117400,106727,10673,502100]
[null,17,"(주)새김어페럴",{"$f":"VLOOKUP(E27,[1]전자계약!A:B,2,FALSE)","v":"일괄 전자계약"},2178118320,1,12900,2322,2500,null,0,0,0,null,2322,2110,212,13078]
[null,18,"(주)스타일에스",{"$f":"VLOOKUP(E28,[1]전자계약!A:B,2,FALSE)","v":"일괄 전자계약"},2858100181,1,26900,5380,null,null,0,0,0,null,5380,4890,490,21520]
[null,19,"(주)씨스리글로벌",{"$f":"VLOOKUP(E29,[1]전자계약!A:B,2,FALSE)","v":"일괄 전자계약"},2018187273,54,471510,84964,10000,null,46090,46090,0,null,84964,77240,7724,396546]
[null,20,"(주)아이엔에프아이엑스",{"$f":"VLOOKUP(E30,[1]전자계약!A:B,2,FALSE)","v":"일괄 전자계약"},1058691232,107,2086840,364920,111000,null,-32140,-3450,-28690,null,393610,357827,35783,1804230]
[null,21,"(주)에프알제이",{"$f":"VLOOKUP(E31,[1]전자계약!A:B,2,FALSE)","v":"일괄 전자계약"},2138636694,10265,109035050,38221558,null,null,169400,0,169400,null,38052158,34592870,3459288,70982892]
[null,22,"(주)엠도씨",{"$f":"VLOOKUP(E32,[1]전자계약!A:B,2,FALSE)","v":"일괄 전자계약"},1058716360,3,104000,26000,null,null,0,0,0,null,26000,23636,2364,78000]
[null,23,"(주)올진컴퍼니",{"$f":"VLOOKUP(E33,[1]전자계약!A:B,2,FALSE)","v":"일괄 전자계약"},7868800418,15,215100,35224,7500,null,0,0,0,null,35224,32021,3203,187376]
[null,24,"(주)월비통상",{"$f":"VLOOKUP(E34,[1]전자계약!A:B,2,FALSE)","v":"일괄 전자계약"},2068165575,1,29500,3835,2500,null,0,0,0,null,3835,3486,349,28165]
[null,25,"(주)이지바이",{"$f":"VLOOKUP(E35,[1]전자계약!A:B,2,FALSE)","v":"일괄 전자계약"},5308100418,13,173600,22568,2500,null,0,0,0,null,22568,20516,2052,153532]
[null,26,"(주)이투컴",{"$f":"VLOOKUP(E36,[1]전자계약!A:B,2,FALSE)","v":"일괄 전자계약"},1208646338,1,8900,1780,2500,null,0,0,0,null,1780,1618,162,9620]
[null,27,"(주)제이브로스",{"$f":"VLOOKUP(E37,[1]전자계약!A:B,2,FALSE)","v":"일괄 전자계약"},2118836824,2,49600,8928,6000,null,0,0,0,null,8928,8116,812,46672]
[null,28,"(주)조이컴퍼니",{"$f":"VLOOKUP(E38,[1]전자계약!A:B,2,FALSE)","v":"일괄 전자계약"},5048614543,1,32900,8225,2500,null,0,0,0,null,8225,7477,748,27175]
[null,29,"(주)컨트롤케이앤제이",{"$f":"VLOOKUP(E39,[1]전자계약!A:B,2,FALSE)","v":"일괄 전자계약"},2158795250,146,2141930,614577,110000,null,255670,255670,0,null,614577,558706,55871,1637353]
[null,30,"(주)코스메이트",{"$f":"VLOOKUP(E40,[1]전자계약!A:B,2,FALSE)","v":"일괄 전자계약"},1098606663,3,35600,4350,null,null,0,0,0,null,4350,3954,396,31250]
[null,31,"(주)패션지오",{"$f":"VLOOKUP(E41,[1]전자계약!A:B,2,FALSE)","v":"일괄 전자계약"},1108172945,259,3092980,515180,12500,null,107420,107420,0,null,515180,468345,46835,2590300]
[null,32,"365BUY",{"$f":"VLOOKUP(E42,[1]전자계약!A:B,2,FALSE)","v":"일괄 전자계약"},5021775155,2,27800,4170,2500,null,0,0,0,null,{"$f":"ROUND(H42-M42,0)","v":4170},{"$f":"INT(O42/1.1)","v":3790},{"$f":"+O42-P42","v":380},{"$f":"ROUND(+G42+I42-J42-O42-N42,0)","v":26130}]
[null,33,"ACT company",{"$f":"VLOOKUP(E43,[1]전자계약!A:B,2,FALSE)","v":"일괄 전자계약"},1061093752,1,8900,1157,2500,null,0,0,0,null,1157,1051,106,10243]
[null,34,"addamam",{"$f":"VLOOKUP(E44,[1]전자계약!A:B,2,FALSE)","v":"일괄 전자계약"},3148662952,1,13900,2502,2500,null,0,0,0,null,2502,2274,228,13898]
[null,35,"HU컴퍼니",{"$f":"VLOOKUP(E45,[1]전자계약!A:B,2,FALSE)","v":"일괄 전자계약"},1040137937,14,256700,27981,15000,null,0,0,0,null,27981,25437,2544,243719]
[null,36,"M. K",{"$f":"VLOOKUP(E46,[1]전자계약!A:B,2,FALSE)","v":"일괄 전자계약"},2030338111,64,819500,163900,87500,null,0,0,0,null,163900,149000,14900,743100]
[null,37,"private100",{"$f":"VLOOKUP(E47,[1]전자계약!A:B,2,FALSE)","v":"일괄 전자계약"},4208700525,1,29800,4470,null,null,0,0,0,null,4470,4063,407,25330]
[null,38,"XM(엑스엠)",{"$f":"VLOOKUP(E48,[1]전자계약!A:B,2,FALSE)","v":"일괄 전자계약"},1303429244,1,66000,9900,null,null,0,0,0,null,9900,9000,900,56100]
[null,39,"간지나라",{"$f":"VLOOKUP(E49,[1]전자계약!A:B,2,FALSE)","v":"일괄 전자계약"},1081188290,16,110400,13248,5000,null,0,0,0,null,13248,12043,1205,102152]
[null,40,"더비오유컴퍼니 주식회사",{"$f":"VLOOKUP(E50,[1]전자계약!A:B,2,FALSE)","v":"일괄 전자계약"},1958600831,57,256500,32465,15000,null,4700,2350,2350,null,30115,27377,2738,241385]
[null,41,"두인 코퍼레이션",{"$f":"VLOOKUP(E51,[1]전자계약!A:B,2,FALSE)","v":"일괄 전자계약"},2151478276,2,49800,9960,2500,null,0,0,0,null,9960,9054,906,42340]
[null,42,"드레스날다",{"$f":"VLOOKUP(E52,[1]전자계약!A:B,2,FALSE)","v":"일괄 전자계약"},2152387888,1,30900,4635,2500,null,0,0,0,null,4635,4213,422,28765]
[null,43,"또래친구 주식회사",{"$f":"VLOOKUP(E53,[1]전자계약!A:B,2,FALSE)","v":"일괄 전자계약"},1268657527,23,363700,65466,null,null,0,0,0,null,65466,59514,5952,298234]
[null,44,"레디코",{"$f":"VLOOKUP(E54,[1]전자계약!A:B,2,FALSE)","v":"일괄 전자계약"},1101119103,28,326900,58842,12500,null,0,0,0,null,58842,53492,5350,280558]
[null,45,"민영상사",{"$f":"VLOOKUP(E55,[1]전자계약!A:B,2,FALSE)","v":"일괄 전자계약"},2110532844,4,52200,6264,null,null,0,0,0,null,6264,5694,570,45936]
[null,46,"바나나팜스",{"$f":"VLOOKUP(E56,[1]전자계약!A:B,2,FALSE)","v":"일괄 전자계약"},1011231435,5,132000,23760,10000,null,0,0,0,null,23760,21600,2160,118240]
[null,47,"바블링브룩",{"$f":"VLOOKUP(E57,[1]전자계약!A:B,2,FALSE)","v":"일괄 전자계약"},2042725541,1,100,-198,5000,null,-1200,-792,-408,null,210,190,20,4890]
[null,48,"비전트리",{"$f":"VLOOKUP(E58,[1]전자계약!A:B,2,FALSE)","v":"일괄 전자계약"},1200985062,1,129000,19350,null,null,0,0,0,null,19350,17590,1760,109650]
[null,49,"스타일도매",{"$f":"VLOOKUP(E59,[1]전자계약!A:B,2,FALSE)","v":"일괄 전자계약"},1221494974,10,86800,17360,2500,null,0,0,0,null,17360,15781,1579,71940]
[null,50,"시장닷컴",{"$f":"VLOOKUP(E60,[1]전자계약!A:B,2,FALSE)","v":"일괄 전자계약"},2158620451,1,49800,7470,null,null,0,0,0,null,7470,6790,680,42330]
[null,51,"신사야(2011724447)",{"$f":"VLOOKUP(E61,[1]전자계약!A:B,2,FALSE)","v":"일괄 전자계약"},2011724447,4,141800,28360,7500,null,0,0,0,null,28360,25781,2579,120940]
[null,52,"아쿠아밸유(aquavalue)",{"$f":"VLOOKUP(E62,[1]전자계약!A:B,2,FALSE)","v":"일괄 전자계약"},6101861551,15,164190,18960,2500,null,15910,0,15910,null,3050,2772,278,163640]
[null,53,"웰파코리아(주)",{"$f":"VLOOKUP(E63,[1]전자계약!A:B,2,FALSE)","v":"일괄 전자계약"},2898101178,5,53500,10700,null,null,0,0,0,null,10700,9727,973,42800]
[null,54,"이프랜드",{"$f":"VLOOKUP(E64,[1]전자계약!A:B,2,FALSE)","v":"일괄 전자계약"},1273210482,5,49500,7425,7500,null,0,0,0,null,7425,6750,675,49575]
[null,55,"제이케이어패럴 주식회사",{"$f":"VLOOKUP(E65,[1]전자계약!A:B,2,FALSE)","v":"일괄 전자계약"},4828800404,12,77800,14004,2500,null,0,0,0,null,14004,12730,1274,66296]
[null,56,"㈜셀러허브",{"$f":"VLOOKUP(E66,[1]전자계약!A:B,2,FALSE)","v":"일괄 전자계약"},2118881810,692,9295700,1037212,421000,null,133480,84337.800000000119,49142.199999999953,null,988070,898245,89825,8728630]
[null,57,"주식회사 넥시스코어",{"$f":"VLOOKUP(E67,[1]전자계약!A:B,2,FALSE)","v":"일괄 전자계약"},1328617286,4,71000,10650,5500,null,0,0,0,null,10650,9681,969,65850]
[null,58,"주식회사 뉴키즈온",{"$f":"VLOOKUP(E68,[1]전자계약!A:B,2,FALSE)","v":"일괄 전자계약"},2018632899,403,6512420,840233,62000,null,442680,358290,84390,null,755843,687130,68713,5818577]
[null,59,"주식회사 상보아이엔티",{"$f":"VLOOKUP(E69,[1]전자계약!A:B,2,FALSE)","v":"일괄 전자계약"},2768700423,5,49500,4950,7500,null,0,0,0,null,4950,4500,450,52050]
[null,60,"주식회사 아들과딸",{"$f":"VLOOKUP(E70,[1]전자계약!A:B,2,FALSE)","v":"일괄 전자계약"},1218620758,1,108000,16200,null,null,0,0,0,null,16200,14727,1473,91800]
[null,61,"주식회사 알유진코리아",{"$f":"VLOOKUP(E71,[1]전자계약!A:B,2,FALSE)","v":"일괄 전자계약"},2068649944,234,3159500,400488,null,null,177900,160747,17153,null,383335,348486,34849,2776165]
[null,62,"주식회사 야벳",{"$f":"VLOOKUP(E72,[1]전자계약!A:B,2,FALSE)","v":"일괄 전자계약"},5238100142,19,199390,39846,null,null,8410,2225,6185,null,33661,30600,3061,165729]
[null,63,"주식회사 에이블에이치",{"$f":"VLOOKUP(E73,[1]전자계약!A:B,2,FALSE)","v":"일괄 전자계약"},2098159714,160,2595400,402254,90000,null,213100,213100,0,null,402254,365685,36569,2283146]
[null,64,"주식회사 에포드",{"$f":"VLOOKUP(E74,[1]전자계약!A:B,2,FALSE)","v":"일괄 전자계약"},1278647944,94,1718230,272344,21500,null,33170,33170,0,null,272344,247585,24759,1467386]
[null,65,"주식회사 엠엠마일즈",{"$f":"VLOOKUP(E75,[1]전자계약!A:B,2,FALSE)","v":"일괄 전자계약"},7818100734,907,13310650,2125295,130000,null,867250,474540,392710,null,1732585,1575077,157508,11708065]
[null,66,"주식회사 영민네트웍스",{"$f":"VLOOKUP(E76,[1]전자계약!A:B,2,FALSE)","v":"일괄 전자계약"},1288705416,6,261600,39240,null,null,0,0,0,null,{"$f":"ROUND(H76-M76,0)","v":39240},{"$f":"INT(O76/1.1)","v":35672},{"$f":"+O76-P76","v":3568},{"$f":"ROUND(+G76+I76-J76-O76-N76,0)","v":222360}]
[null,67,"주식회사 원페이스",{"$f":"VLOOKUP(E77,[1]전자계약!A:B,2,FALSE)","v":"일괄 전자계약"},2158676580,1,12000,2400,2500,null,0,0,0,null,2400,2181,219,12100]
[null,68,"주식회사 웹이즈",{"$f":"VLOOKUP(E78,[1]전자계약!A:B,2,FALSE)","v":"일괄 전자계약"},4108177985,250,1223870,146869,90000,null,0,0,0,null,146869,133517,13352,1167001]
[null,69,"주식회사 이루자",{"$f":"VLOOKUP(E79,[1]전자계약!A:B,2,FALSE)","v":"일괄 전자계약"},1228634629,3,173300,25995,null,null,0,0,0,null,25995,23631,2364,147305]
[null,70,"주식회사 자야",{"$f":"VLOOKUP(E80,[1]전자계약!A:B,2,FALSE)","v":"일괄 전자계약"},1378610537,14,229600,41328,5000,null,0,0,0,null,41328,37570,3758,193272]
{"$rows_left_out":46}
{"sheet":"SCM","index":7,"n_rows":43,"n_cols":2,"rows_kept":43,"cut":false,"hidden":false,"merged":[]}
[]
[null,"6. seller-SCM"]
[]
[null,"실제 계산서 발행금액 조회되도록. "]
[]
[null,"SCM -> 정산완료조회"]
[null,"BOS와 동일 메뉴 사용"]
{"$rows_empty":26}
[null,"정산확정 합계에 표시되는 공급가 총액 / 세액 총액 / 세금계산서 발행금액(VAT 포함) -> BOS 정산 시 사용하는 [정산완료조회] 메뉴와 같은 값이 뜨도록."]
[]
[null,"① 세금계산서 발행금액(VAT포함) -> 수식 변경 : = round(수수료-자사분담액, 0) "]
[]
[null,"② 공급가 총액 -> 수식 변경 : = int(A/1.1) "]
[]
[null,"③ 세액 총액 -> 수식 변경 : = A - B"]
[]
[null,"④ 정산 기준월에 따른 미수금 및 기타차감 금액 요약 표시"]
[null,"-> 업체가 미수금 or 기타차감내용을 확인할 수 있으면 좋겠습니다."]