{"text_format":"2","workbook":"xlsx","n_sheets":11,"sheets":["요건 건수","Reversion","요구사항정의서","vip 요구사항","관계사요구사항","요청 산출물 리스트","마이그레이션범위","TOBE FRONT IA","질의응답","TOBE BOS IA","DATA COLUMN SHEET"],"not_rendered":{"charts":0,"images":0,"macros":0,"external_links":0,"defined_names":2,"comments":0,"pivot_tables":1},"unopened":[],"bounds":{"document_bytes":16777216,"sheet_cells":100000,"run_cost":"one","rows_first":2000,"rows_last":500,"rows_between":2000,"halvings":0,"cell_chars":16384,"cell_head_chars":4096},"cells_cut":0,"cells_raw":0,"read":"whole","date_system":"1900"}

{"sheet":"요건 건수","index":0,"n_rows":21,"n_cols":5,"rows_kept":21,"cut":false,"hidden":true,"merged":[]}
[]
[]
["행 레이블","개수 : 중분류",null,"요구사항코드","코드규칙"]
["01_개발 사양",12,null,"01_개발 사양","IST_01_"]
["02_I.F/MIG/연동/솔루션",9,null,"02_I.F/MIG/연동/솔루션","IST_02_"]
["03_화면UI공통",5,null,"03_화면UI공통","IST_03_"]
["04_카테고리",5,null,"04_카테고리","IST_04_"]
["05_검색/전시공통",13,null,"05_검색/전시공통","IST_05_"]
["06_브랜드샵",4,null,"06_브랜드샵","IST_06_"]
["07_전시메뉴",5,null,"07_전시메뉴","IST_07_"]
["08_이벤트/기획전",6,null,"08_이벤트/기획전","IST_08_"]
["09_상품관리",20,null,"09_상품관리","IST_09_"]
["10_프로모션",11,null,"10_프로모션","IST_10_"]
["11_주문결제",9,null,"11_주문결제","IST_11_"]
["12_주문/클레임",14,null,"12_주문/클레임","IST_12_"]
["13_제휴주문관리",2,null,"13_제휴주문관리","IST_13_"]
["14_고객센터/커뮤니티",9,null,"14_고객센터/커뮤니티","IST_14_"]
["15_특화서비스",6,null,"15_특화서비스","IST_15_"]
["16_회원/멤버쉽",15,null,"16_회원/멤버쉽","IST_16_"]
["17_운영관리",16,null,"17_운영관리","IST_17_"]
{"$rows_left_out":2}
{"sheet":"Reversion","index":1,"n_rows":9,"n_cols":6,"rows_kept":9,"cut":false,"hidden":false,"merged":[[0,1,0,5]]}
[null,"Reversion History"]
[]
[null,"버전","내용","작성일","요청자","작성자"]
[null,"V1.00","초안 작성","2020-05-14","정지혜","정지혜"]
[null,"V1.10","요구 범위 변경 및 조정","2020-06-12","박중재","정지혜"]
[null,"V1.20","요구 범위 변경 및 조정\n- 선물 하기 제외 外","2020-07-03","박중재","정지혜"]
[null,"V1.30","범위 문서 업데이트\n- 산출물 리스트 추가\n- To-BE Front IA 가안 추가","2020-07-10","정지혜","정지혜"]
[null,"V1.40","7월 16일 질의응답 답변 내용 기반으로  요구사항 내용 일부 업데이트","2020-09-09","조현민","조현민"]
[null,"V1.41","추가 확인 필요사항 작성 (요구사항정의서 > 이슈사항)","2020-09-10","조현민","조현민"]

{"sheet":"요구사항정의서","index":2,"n_rows":169,"n_cols":14,"rows_kept":169,"cut":false,"hidden":false,"merged":[[0,1,0,3]]}
[null,"ST24_온라인몰 신규 구축 요구사항정의서"]
[]
[null,"대분류","중분류","요구사항","상세 기능 요건 사항","요구번호","요청부서","요청일","수용여부","의사결정일","이슈사항","화면설계ID","프로그램ID","통합테스트 CASE ID"]
[null,"01_개발 사양","개발범위","Front - IStyle24 PC / Mobile Web / Mobile app(AOS/IOS)\nBOS / SCM",null,{"$f":"CONCATENATE((VLOOKUP(B4,'요건 건수'!$D$4:$E$20,2)),COUNTIFS(B$4:B4,B4))","v":"IST_01_1"},"기획운영팀",null,null,null,"대응 해야할 최저 OS 버전 확인 필요"]
[null,"01_개발 사양","관리자의 환경","관리자를 개별메뉴나 디바이스별 분리하는 형태로 구현하지 않는다.\n콘텐츠 관리는 모바일/PC 통일하여 일원화된 관리구조를 고려 한다.\n관리자의 접속은 브라우저에 관계없이 접속 및 동작되어야 한다.(IE 만 가능 등 불허)",null,{"$f":"CONCATENATE((VLOOKUP(B5,'요건 건수'!$D$4:$E$20,2)),COUNTIFS(B$4:B5,B5))","v":"IST_01_2"},"기획운영팀",null,"수용","2020-12-07"]
[null,"01_개발 사양","도메인","현 페이지 별 분산된 도메인을 정리하여 일괄 도메인으로 처리할 수 있어야 한다.\n도메인 변경 시 도메인에 대한 연결 처리가 진행되어야 한다.\n- mall.isytle.com\n- event.istyle.com\n- www.istyle.com",null,{"$f":"CONCATENATE((VLOOKUP(B6,'요건 건수'!$D$4:$E$20,2)),COUNTIFS(B$4:B6,B6))","v":"IST_01_3"},"기획운영팀",null,"수용","2020-12-07","image 도메인만 별도로 하고 그 외는 www.style24.com 으로 한다.\n- 이미지도메인: image.style24.com"]
[null,"01_개발 사양","모바일앱","하이브리드 Webwiew 방식으로 구현하고, 일부 Native 영역으로 구현한다.\n- 설계 시 네이티브 영역에 대해 명시하여야 한다.\n- 네이티브 영역은 인트로, 스플래시 정도만 구현",null,{"$f":"CONCATENATE((VLOOKUP(B7,'요건 건수'!$D$4:$E$20,2)),COUNTIFS(B$4:B7,B7))","v":"IST_01_4"},"기획운영팀",null,"수용","2020-12-07","좌측의 범위면 OK"]
[null,"01_개발 사양","모바일웹","디바이스 체크 후 모바일에서 접근시 모바일 버전으로 노출한다.",null,{"$f":"CONCATENATE((VLOOKUP(B8,'요건 건수'!$D$4:$E$20,2)),COUNTIFS(B$4:B8,B8))","v":"IST_01_5"},"기획운영팀",null,"수용","2020-12-07"]
[null,"01_개발 사양","보안/검수관련","KISA시큐어 코딩 가이드를 준수한다. ",null,{"$f":"CONCATENATE((VLOOKUP(B9,'요건 건수'!$D$4:$E$20,2)),COUNTIFS(B$4:B9,B9))","v":"IST_01_6"},"정보보호팀",null,"수용","2020-12-07"]
[null,"01_개발 사양","브라우저최적화","여러 디바이스(PC/모바일) 및 브라우저 최적화(IE11이상, chrome, safari, NAVER browser)",null,{"$f":"CONCATENATE((VLOOKUP(B10,'요건 건수'!$D$4:$E$20,2)),COUNTIFS(B$4:B10,B10))","v":"IST_01_7"},"기획운영팀",null,"수용","2020-12-07"]
[null,"01_개발 사양","성능/사용성","CDN 및 리사이징 툴을 적용 하여 속도 및 관리 사용성을 향상하여야 한다.",null,{"$f":"CONCATENATE((VLOOKUP(B11,'요건 건수'!$D$4:$E$20,2)),COUNTIFS(B$4:B11,B11))","v":"IST_01_8"},"기획운영팀",null,"수용","2020-12-07","단, 해당 부분은 CDN 및 리시아징 툴 업체의 성능의 문제임"]
[null,"01_개발 사양","암호화","개인정보는 암호화 하여 통신되어야 한다.",null,{"$f":"CONCATENATE((VLOOKUP(B12,'요건 건수'!$D$4:$E$20,2)),COUNTIFS(B$4:B12,B12))","v":"IST_01_9"},"정보보호팀",null,"수용","2020-12-07","SSL 적용하는 것으로 대체하기 때문에 별도 구현은 필요 없다. 암호화 칼럼은 DB에 암호화 해 처리한다."]
[null,"01_개발 사양","언어/프레임워크","개발 언어는 JAVA로 구현되어야 한다.\nDB - my sql / ms sql 중 사용한다.\n--> MY SQL 로 구현",null,{"$f":"CONCATENATE((VLOOKUP(B13,'요건 건수'!$D$4:$E$20,2)),COUNTIFS(B$4:B13,B13))","v":"IST_01_10"},"VIP_J","2020-06-12","수용","2020-06-12"]
[null,"01_개발 사양","웹접근성","웹 접근성을 준수하는 형태로 구현한다.\n- 인증심사는 미진행하는 것으로 한다.",null,{"$f":"CONCATENATE((VLOOKUP(B14,'요건 건수'!$D$4:$E$20,2)),COUNTIFS(B$4:B14,B14))","v":"IST_01_11"},"정보보호팀",null,"수용","2020-12-07"]
[null,"01_개발 사양","제안솔루션","제안 기능에 대한 내용이 솔루션이 필요할 경우, 솔루션에 대한 소개 및 비용을 함께 제시하여야 한다.",null,{"$f":"CONCATENATE((VLOOKUP(B15,'요건 건수'!$D$4:$E$20,2)),COUNTIFS(B$4:B15,B15))","v":"IST_01_12"},"기획운영팀"]
[null,"02_I.F/MIG/연동/솔루션","데이터 연동","다음 시스템과 연동 개발이 진행되어야 한다.\n- 알림톡/SMS/LMS/E-mail/PUSH/개인화/기타연동시스템/WMS/CTI > 알림톡 신규 추가","WMS - API 인터페이스 진행, API는 업체 : Slow 개발 예정",{"$f":"CONCATENATE((VLOOKUP(B16,'요건 건수'!$D$4:$E$20,2)),COUNTIFS(B$4:B16,B16))","v":"IST_02_1"},"개발팀",null,"수용","2020-12-07","1.개인화는 없음\n2.CTI 연동은 고객인입 시 휴대전화번호로 연계하여 회원상세 페이지 노출하는 것으로 처리"]
[null,"02_I.F/MIG/연동/솔루션","마이그레이션","기존 운영중인 마이그레이션 방안을 제시하여야 한다.\n- 마이그레이션 범위는 별첨 시트_migration를 참조한다.",null,{"$f":"CONCATENATE((VLOOKUP(B17,'요건 건수'!$D$4:$E$20,2)),COUNTIFS(B$4:B17,B17))","v":"IST_02_2"},"기획운영팀",null,"수용","2020-12-07"]
[null,"02_I.F/MIG/연동/솔루션","배치관리","운영 필요시 배치가 생성되어야 하며 배치 관리를 진행할 수 있어야 한다.\n- 배치리스트 및 배치 실행할 수 있는 관리 툴 필요\n- 배치 중단 기능 필요\n- 배치에 대한 실행 텀 및 실행자 등의 히스토리 관리 필요","- 배치 목록\n- 배치 실행 기능\n- 배치 상태\n- 배치 실행 시간\n- 배치 실행자(아이디/이름)\n- 배치 중단\n- 배치 중단 시간\n- 배치 중단 사유",{"$f":"CONCATENATE((VLOOKUP(B18,'요건 건수'!$D$4:$E$20,2)),COUNTIFS(B$4:B18,B18))","v":"IST_02_3"},"기획운영팀",null,"수용","2020-12-07","이미 실행되고 있는 배치 서비스에 대한 중단은 할 수 없다. 단, 다음 실행부터의 중단 기능은 적용 가능"]
[null,"02_I.F/MIG/연동/솔루션","상품등록솔루션","입점사의 상품 등록 솔루션을 지원 해야 한다.\n- 사방넷/플레이오토/샵링커/ec모니터",null,{"$f":"CONCATENATE((VLOOKUP(B19,'요건 건수'!$D$4:$E$20,2)),COUNTIFS(B$4:B19,B19))","v":"IST_02_4"},"패션팀",null,"불가","2020-12-07","입점사에 대해서는 어드민이 완료된 후 셀러툴 업체에서 진행해야 한다.",null,"A2002"]
[null,"02_I.F/MIG/연동/솔루션","수집/분석","광고 분석 툴에 대한 설치/수집/동작할 수 있도록 하여야 한다.\n- 페이스북 픽셀 툴에 대한 설치가 진행 되어야 한다.\n- 구글 리타겟팅 툴에 대한 설치가 진행 되어야 한다.",null,{"$f":"CONCATENATE((VLOOKUP(B20,'요건 건수'!$D$4:$E$20,2)),COUNTIFS(B$4:B20,B20))","v":"IST_02_5"},"기획운영팀",null,"수용","2020-12-07","광고스크립트임"]
{"$rows_left_out":150}
{"sheet":"vip 요구사항","index":3,"n_rows":10,"n_cols":5,"rows_kept":10,"cut":false,"hidden":true,"merged":[[0,1,0,4]]}
[null,"VIP 요청사항"]
[]
[null,"중분류","상세요구사항","수용여부","요청사"]
[null,"결제수단","세이페이 도입","수용","김석환 대표"]
[null,"신규서비스","유료 혹은 멤버회원만 접근이 가능한 기획전 등의 폐쇄 기획전 개발필요\n- 기획전 접근 조건에 대한 기능 필요","수용","김석환 대표"]
[null,"신규서비스","정기배송 서비스 (구독/정기배송)","미수용","김지원 대표"]
[null,"신규서비스","2개 이상 사이즈 배송 후 하나 반품 하는 서비스\n- 런드리고 등과 제휴하여 라스트마일 서비스 구현 검토","미수용","김석환 대표"]
[null,"신규서비스","크라우드펀딩 벤치마킹 : 제품 제작전 소비자의 참여/니즈수렴 (게시판/투표기능) → 이후 제품 제작에 반영 ,  전체 과정이 하나의 컨텐츠가 될수 있다","미수용","김지원 대표"]
[null,"신규서비스","유료 회원 서비스 수립","미수용","김지원 대표"]
[null,"개발","개발언어 JAVA / DB : my sql 검토","수용","김석환 대표"]

{"sheet":"관계사요구사항","index":4,"n_rows":45,"n_cols":4,"rows_kept":45,"cut":false,"hidden":true,"merged":[[0,1,0,3]]}
[null,"관계사 요청 사항"]
[]
[null,"중분류","상세요구사항","요청사"]
[null,"결제","비로그인시 네이버아이디만으로 즉시 구매","한세드림"]
[null,"프로모션","프로모션 다양하게 적용 가능한 상세페이지(1+1 프로모션)","한세드림"]
[null,"검색","검색필터세분화","한세드림"]
[null,"화면공통/UI","사이즈 옵션 확인 보기쉽게","한세드림"]
[null,"화면공통/UI","카테코리 직관적으로 보이도록 UI변경","한세드림"]
[null,"상품","신상품과 이월이 구분되었으면 함. 현재는 상품이 뒤섞여 있어 시즌 신상품 노출이 제대로 안되고 있음.","한세드림"]
[null,"상품","품명이 너무 길고 모든 정보를 다 담으려고 해서 소비자들이 보기 어려움. 모이몰른을 예로 들면 품명에 품번까지 다 노출되어 있음. 품번이 노출될 필요는 없어 보임.","한세드림"]
[null,"검색","검색 기능 강화 필요해 보임.(현재는 검색어에 품명에 기재되어 있는 내용이 들어가야만 검색 가능. 예를들어 ‘모이몰른 긴팔티’ 로 검색시 품명에 ‘모이몰른’과’긴팔티’가 들어가 있는 한스타일만 조회됨.)","한세드림"]
[null,"상품","카테고리&아이템 명 정리 필요: 현재는 사용하지 않는 카테고리 명이 노출되어 있고 카테고리 구분도 명확하지 않음 (이 부분은 추후 논의가 필요할 것 같음.)","한세드림"]
[null,"검색","상세검색 조건 보강되었으면 함: 모이몰른 기준 à 신상,이월 / AGE (베이비, 토들러)..","한세드림"]
[null,"화면공통/UI","와이드 화면에 맞게 호환","한세드림"]
[null,"상품","토들러~주니어사이즈 한 화면에서 구매할 수 있었으면 함 (NOF11QJM54화면에서 140~170사이즈 구매 원할시 NOF13QJM54화면으로 넘어가거나 혹은 사이즈 옵션 추가되었으면 좋겠음)","한세드림"]
[null,"상품","세트코디되는 상품 나란히 배열 혹은 구매화면에서 세트코디되는 상품 보여주기","한세드림"]
[null,"상품","조던 가방 성인 카테고리에서도 보여주기 (나이키 온라인스토어에서 한세 수주상품 성인 카테고리에서 판매중)","한세드림"]
[null,"브랜드샵","브랜드 컨텐츠 노출이 별도로 되었으면 좋겠음\n- 회원들간의 커뮤니티 활성화 목적의 이벤트 진행 \n- 광고, 룩북, 영상 등 공개-아이템 연동 노출","한세MK"]
[null,"커뮤니티","사이즈 추천/후기 작성 추가\n-구매 고객이 남긴 사이즈 추천 리뷰를 통해 구매고객 편의 제공\n-후기: 일반후기, 상품 사진 후기, 스타일 후기, 사이즈 추천\n(후기를 통한 2차 컨텐츠 노출 가능/후기 등록 고객 추가 마일리지, 등급 UP 등 베네핏 추가)","한세MK"]
[null,"상품","상품상세 페이지 UI 사용성확보\n상세페이지 적용시 한 스크롤 내에서도 제품 정보를 얻고 구매가 바로 가능하도록 디자인 구성\n(참조몰 코오롱/한섬/SSG)","한세MK"]
{"$rows_left_out":26}
{"sheet":"요청 산출물 리스트","index":5,"n_rows":31,"n_cols":5,"rows_kept":31,"cut":false,"hidden":false,"merged":[[0,1,0,4]]}
[null,"요청 산출물 리스트"]
[]
[null,null,"파트","산출물 리스트","작업주체"]
[null,1,"기획","요구사항 정의서","현업"]
[null,2,null,"기능정의서","수행사"]
[null,3,null,"서비스 정책서(프로세스정의서)","수행사"]
[null,4,null,"IA(Front / BOS)","수행사"]
[null,5,null,"화면설계서(Front / BOS)","수행사"]
[null,6,"디자인","디자인 PSD 전본","수행사"]
[null,7,null,"디자인 스타일 가이드","수행사"]
[null,8,null,"배너 운영 가이드","수행사"]
[null,9,"퍼블리싱","HTML/CSS 원본","수행사"]
[null,10,null,"CSS 스타일 가이드","수행사"]
[null,11,"구현/개발","ERD","수행사"]
[null,12,null,"테이블 명세서","수행사"]
[null,13,null,"Program 명세서","수행사"]
[null,14,null,"Program 목록","수행사"]
[null,15,null,"Batch/프로시저/인터페이스 LIST","수행사"]
[null,16,null,"개발 프로그램 소스","수행사"]
[null,17,"테스트","단위 테스트 시나리오(Front / BOS)","수행사"]
{"$rows_left_out":12}
{"sheet":"마이그레이션범위","index":6,"n_rows":26,"n_cols":5,"rows_kept":26,"cut":false,"hidden":false,"merged":[]}
[null,"DATA MIGRATION 기준"]
[]
[null,"구분","데이터","MIG/데이터이관 여부","비고"]
[null,"구bos","협력사 정보","O"]
[null,null,"공급처 정보","O"]
[null,null,"물류정보","O"]
[null,null,"택배사정보","O"]
[null,null,"브랜드","O"]
[null,null,"표준분류",null,"기존 표준분류와 신규 데이터와 매핑 필요"]
[null,null,"전시카테고리","X","상품 마이그레이션시 신규 카테고리 생성하여 매핑예정"]
[null,null,"상품정보","O","판매종료된 OLD 상품에 대한 구분 필요"]
[null,null,"상품평","O"]
[null,null,"1:1 문의","O"]
[null,null,"상품문의","O"]
[null,null,"회원정보","O"]
[null,null,"쿠폰"]
[null,null,"상품권","O"]
[null,null,"아이포인트","O"]
[null,null,"아이머니","O"]
[null,null,"시리얼쿠폰","O"]
{"$rows_left_out":7}
{"sheet":"TOBE FRONT IA","index":7,"n_rows":242,"n_cols":9,"rows_kept":242,"cut":false,"hidden":false,"merged":[[0,2,0,8]]}
[null,null,"TO-BE FRONT IA  현업 1차 가안"]
[]
[null,"No","1 Depth","2 Depth","3 Depth","4 Depth","5 Depth","Page Type","비고"]
[null,1,"홈",{"$nulls":4},"Page"]
[null,2,"브랜드","브랜드 목록","ㄱㄴㄷ형",null,null,"Tab"]
[null,3,null,null,"ABC형",null,null,"Tab"]
[null,4,null,null,"브랜드 개별메인",null,null,"Page"]
[null,5,null,null,"브랜드 카테고리",null,null,"Page"]
[null,6,"BEST",{"$nulls":4},"Page"]
[null,7,"핫딜",{"$nulls":4},"Page","하루특가 -> 변경"]
[null,8,"총알배송",{"$nulls":4},"Page"]
[null,9,"아울렛",{"$nulls":4},"Page"]
[null,10,"룩북","Index","목록 있음",null,null,"Page"]
[null,11,null,null,"목록 없음",null,null,"Page"]
[null,12,null,"상세",null,null,null,"Page"]
[null,13,"기획전","Index","목록 있음",null,null,"Page"]
[null,14,null,null,"목록 없음",null,null,"Page"]
[null,15,null,"기획전 상세",null,null,null,"Page"]
[null,16,"이벤트","Index","목록 있음",null,null,"Page"]
[null,17,null,null,"목록 없음",null,null,"Page"]
{"$rows_left_out":223}
{"sheet":"질의응답","index":8,"n_rows":337,"n_cols":11,"rows_kept":337,"cut":false,"hidden":false,"merged":[[0,1,0,3]]}
[null,"ST24_온라인몰 신규 구축 질의응답"]
[]
[null,"대분류","중분류","요구사항","상세 기능 요건 사항","요구번호","요청부서","질의일","답변일","질의사항","답변내용"]
[null,"01_개발 사양","개발범위","Front - IStyle24 PC / Mobile Web / Mobile app(AOS/IOS)\nBOS / SCM",null,{"$f":"CONCATENATE((VLOOKUP(B4,'요건 건수'!$D$4:$E$20,2)),COUNTIFS(B$4:B4,B4))","v":"IST_01_1"},"기획운영팀"]
[null,"01_개발 사양","관리자의 환경","관리자를 개별메뉴나 디바이스별 분리하는 형태로 구현하지 않는다.\n콘텐츠 관리는 모바일/PC 통일하여 일원화된 관리구조를 고려 한다.\n관리자의 접속은 브라우저에 관계없이 접속 및 동작되어야 한다.(IE 만 가능 등 불허)",null,{"$f":"CONCATENATE((VLOOKUP(B5,'요건 건수'!$D$4:$E$20,2)),COUNTIFS(B$4:B5,B5))","v":"IST_01_2"},"기획운영팀"]
[null,"01_개발 사양","도메인","현 페이지 별 분산된 도메인을 정리하여 일괄 도메인으로 처리할 수 있어야 한다.\n도메인 변경 시 도메인에 대한 연결 처리가 진행되어야 한다.\n- mall.isytle.com\n- event.istyle.com\n- www.istyle.com",null,{"$f":"CONCATENATE((VLOOKUP(B6,'요건 건수'!$D$4:$E$20,2)),COUNTIFS(B$4:B6,B6))","v":"IST_01_3"},"기획운영팀"]
[null,"01_개발 사양","모바일앱","하이브리드 Webwiew 방식으로 구현하고, 일부 Native 영역으로 구현한다.\n- 설계 시 네이티브 영역에 대해 명시하여야 한다.",null,{"$f":"CONCATENATE((VLOOKUP(B7,'요건 건수'!$D$4:$E$20,2)),COUNTIFS(B$4:B7,B7))","v":"IST_01_4"},"기획운영팀",null,null,"- 반드시 네이티브 영역으로 구현되어야 하는 화면/기능이 있는지?\n\n- 대략 생각하고 계신 네이티브 영역의 화면/기능 범위가 어느 정도 인지?(스플래시?/결제? 등)","- 네이티브 영역은 인트로, 스플래시 정도만 구현"]
[null,"01_개발 사양","모바일웹","디바이스 체크 후 모바일에서 접근시 모바일 버전으로 노출한다.",null,{"$f":"CONCATENATE((VLOOKUP(B8,'요건 건수'!$D$4:$E$20,2)),COUNTIFS(B$4:B8,B8))","v":"IST_01_5"},"기획운영팀"]
[null,"01_개발 사양","보안/검수관련","KISA시큐어 코딩 가이드를 준수한다. ",null,{"$f":"CONCATENATE((VLOOKUP(B9,'요건 건수'!$D$4:$E$20,2)),COUNTIFS(B$4:B9,B9))","v":"IST_01_6"},"정보보호팀"]
[null,"01_개발 사양","브라우저최적화","여러 디바이스(PC/모바일) 및 브라우저 최적화(IE11이상, chrome, safari, NAVER browser)",null,{"$f":"CONCATENATE((VLOOKUP(B10,'요건 건수'!$D$4:$E$20,2)),COUNTIFS(B$4:B10,B10))","v":"IST_01_7"},"기획운영팀"]
[null,"01_개발 사양","성능/사용성","CDN 및 리사이징 툴을 적용 하여 속도 및 관리 사용성을 향상하여야 한다.",null,{"$f":"CONCATENATE((VLOOKUP(B11,'요건 건수'!$D$4:$E$20,2)),COUNTIFS(B$4:B11,B11))","v":"IST_01_8"},"기획운영팀"]
[null,"01_개발 사양","암호화","개인정보는 암호화 하여 통신되어야 한다.",null,{"$f":"CONCATENATE((VLOOKUP(B12,'요건 건수'!$D$4:$E$20,2)),COUNTIFS(B$4:B12,B12))","v":"IST_01_9"},"정보보호팀"]
[null,"01_개발 사양","언어/프레임워크","개발 언어는 JAVA로 구현되어야 한다.\nDB - my sql / ms sql 중 사용한다.\n--> MY SQL 로 구현",null,{"$f":"CONCATENATE((VLOOKUP(B13,'요건 건수'!$D$4:$E$20,2)),COUNTIFS(B$4:B13,B13))","v":"IST_01_10"},"VIP_J",null,null,"6/12 DB 변경 Added","6/12 DB 변경 Added"]
[null,"01_개발 사양","웹접근성","웹 접근성을 준수하는 형태로 구현한다.\n- 인증심사는 미진행하는 것으로 한다.",null,{"$f":"CONCATENATE((VLOOKUP(B14,'요건 건수'!$D$4:$E$20,2)),COUNTIFS(B$4:B14,B14))","v":"IST_01_11"},"정보보호팀"]
[null,"01_개발 사양","제안솔루션","제안 기능에 대한 내용이 솔루션이 필요할 경우, 솔루션에 대한 소개 및 비용을 함께 제시하여야 한다.",null,{"$f":"CONCATENATE((VLOOKUP(B15,'요건 건수'!$D$4:$E$20,2)),COUNTIFS(B$4:B15,B15))","v":"IST_01_12"},"기획운영팀"]
[null,"02_I.F/MIG/연동/솔루션","데이터 연동","다음 시스템과 연동 개발이 진행되어야 한다.\n- 알림톡/SMS/LMS/E-mail/PUSH/개인화/기타연동시스템/WMS/CTI","WMS - API 인터페이스 진행, API는 업체 : Slow 개발 예정",{"$f":"CONCATENATE((VLOOKUP(B16,'요건 건수'!$D$4:$E$20,2)),COUNTIFS(B$4:B16,B16))","v":"IST_02_1"},"개발팀",null,null,"- 자동 발송(알림톡/SMS/LMS/E-mail/PUSH)되는 케이스에 대한 정의가 되어 있는지?","- SMS/LMS은 구달로 나가고 있으며, 알림톡으로 진행을 해주어야 함.\n(케이스 정리된 것은 가지고 있으나 1차 안으로 만들어 주면 검토할 예정)"]
[null,"02_I.F/MIG/연동/솔루션","마이그레이션","기존 운영중인 마이그레이션 방안을 제시하여야 한다.\n- 마이그레이션 범위는 별첨 시트_migration를 참조한다.",null,{"$f":"CONCATENATE((VLOOKUP(B17,'요건 건수'!$D$4:$E$20,2)),COUNTIFS(B$4:B17,B17))","v":"IST_02_2"},"기획운영팀"]
[null,"02_I.F/MIG/연동/솔루션","배치관리","운영 필요시 배치가 생성되어야 하며 배치 관리를 진행할 수 있어야 한다.\n- 배치리스트 및 배치 실행할 수 있는 관리 툴 필요\n- 배치 중단 기능 필요\n- 배치에 대한 실행 텀 및 실행자 등의 히스토리 관리 필요","- 배치 목록\n- 배치 실행 기능\n- 배치 상태\n- 배치 실행 시간\n- 배치 실행자(아이디/이름)\n- 배치 중단\n- 배치 중단 시간\n- 배치 중단 사유",{"$f":"CONCATENATE((VLOOKUP(B18,'요건 건수'!$D$4:$E$20,2)),COUNTIFS(B$4:B18,B18))","v":"IST_02_3"},"기획운영팀"]
[null,"02_I.F/MIG/연동/솔루션","상품등록솔루션","입점사의 상품 등록 솔루션을 지원 해야 한다.\n- 사방넷/플레이오토/샵링커/ec모니터",null,{"$f":"CONCATENATE((VLOOKUP(B19,'요건 건수'!$D$4:$E$20,2)),COUNTIFS(B$4:B19,B19))","v":"IST_02_4"},"패션팀"]
[null,"02_I.F/MIG/연동/솔루션","수집/분석","광고 분석 툴에 대한 설치/수집/동작할 수 있도록 하여야 한다.\n- 페이스북 픽셀 툴에 대한 설치가 진행 되어야 한다.\n- 구글 리타겟팅 툴에 대한 설치가 진행 되어야 한다.",null,{"$f":"CONCATENATE((VLOOKUP(B20,'요건 건수'!$D$4:$E$20,2)),COUNTIFS(B$4:B20,B20))","v":"IST_02_5"},"기획운영팀",null,null,"- 해당 툴은 개발사에서 설치 및 동작 확인을 진행하는지 하는지?(펜타 관여X)","개발사 요건으로 들어가 있음"]
{"$rows_left_out":318}
{"sheet":"TOBE BOS IA","index":9,"n_rows":314,"n_cols":9,"rows_kept":314,"cut":false,"hidden":true,"merged":[[0,2,0,8]]}
[null,null,"TO-BE BOS IA  현업 1차 가안"]
[]
[null,"No","1 Depth","2 Depth","3 Depth","4 Depth","5 Depth","Page Type"]
[null,1,null,"협력사 관리","목록"]
[null,2,null,null,"등록"]
[null,3,null,"공급처 관리","공급처 상세","공급처 정보",null,"TAB"]
[{"$nulls":5},"묶음배송컨텐츠 ",null,"TAB"]
[null,4,null,"브랜드 관리"]
[null,null,null,"채널 관리"]
{"$rows_empty":13}
[null,5,"상품 관리","상품 관리","상품등록","일반상품"]
[null,6,null,null,null,"세트상품"]
[null,7,null,null,null,"딜상품"]
[null,8,null,null,null,"상품 일괄 등록"]
[null,9,null,null,"상품 정보 조회"]
[null,10]
[null,11,null,null,"상품 일괄 수정"]
[null,12,null,null,"가격 예약"]
[null,13,null,"상품 승인 관리"]
[null,14,null,"품목 정보 관리","품목 정보 조회"]
{"$rows_left_out":277}
{"sheet":"DATA COLUMN SHEET","index":10,"n_rows":124,"n_cols":18,"rows_kept":124,"cut":false,"hidden":true,"merged":[[0,1,0,12]]}
[null,"구현 요청 DATA SHEET"]
[null,"금액 1원단위, 반올림"]
[]
[null,"협력사 관리",{"$nulls":4},"기본상품",{"$nulls":4},"쿠폰"]
[null,"기본정보","협력사 번호",null,"vendorNo",null,"기본정보","상품번호",null,"ProductID - Unique ",null,"쿠폰기본정보","쿠폰번호",null,"CouponID - Unique ",null,"업체/위탁정산","주문번호"]
[null,null,"협력사 명",{"$nulls":4},"상품명",{"$nulls":4},"쿠폰 구분",null,"즉시할인쿠폰/주문상품쿠폰/장바구니쿠폰/배송비쿠폰",null,null,"매출일자"]
[null,null,"상태",null,"정상/대기/사용중지",null,null,"판촉태그",{"$nulls":4},"쿠폰명",null,"최대 30자",null,null,"매출상태"]
[null,null,"사업자등록번호","변경","사업자 등록번호 기준 사업자 확인 API로 체크\n사업자는 1개 만 등록 가능\n사업자 확인 api 기준으로 대표자명/주소/업태/종목 정보호출",null,null,"매출분류",{"$nulls":4},"쿠폰발급기간",null,"Start date : YYYY-MM-DD HH:MM:SS\nend date : YYYY-MM-DD HH:MM:SS",null,null,"정산상태"]
[null,null,"대표자명",{"$nulls":4},"상품상태",null,"WMS재고 : 입고완료/승인대기/승인보류/판매중/품절/판매중지/삭제\n입점 : 승인대기/승인보류/판매중/판매중지/품절/삭제",null,null,"쿠폰사용기간",null,"Start date : YYYY-MM-DD HH:MM:SS\nend date : YYYY-MM-DD HH:MM:SS",null,null,"상품코드"]
[null,null,"사업자구분",null,"개인/법인",null,null,"스타일No",{"$nulls":4},"쿠폰상태",null,"진행/대기/중지",null,null,"상품명"]
[null,null,"주소",null,"우편번호/도로명/지번(1차주소/2차주소)",null,null,"브랜드",null,null,null,"적용대상","대상브랜드",null,"다중 설정(OR 조건)",null,null,"스타일No"]
[null,null,"대표 전화번호",{"$nulls":4},"공급처",null,"providerNo",null,null,"대상공급처",null,"다중(OR 조건)",null,null,"공급처"]
[null,null,"대표 fax번호",{"$nulls":4},"물류정보",null,"deliveryUnitNo",null,null,"대상카테고리",null,"다중(OR 조건)",null,null,"유통구분"]
[null,null,"등록일자",null,"YYYY-MM-DD HH:MM:SS",null,null,"제조원",{"$nulls":4},"대상상품",null,"다중(OR 조건)",null,null,"브랜드"]
[null,"메모","메모 내용",null,"히스토리화 하여 누적저장",null,null,"원산지",null,"국가 목록 api 활용 하여 목록업데이트 국가 마이그레이션 진행\n- As-is 7개 국가만 있음",null,null,"예외상품",null,"대상에 들어가더라도, 예외에 포함될 경우 예외를 최우선으로 처리",null,null,"단품코드"]
[null,null,"메모입력일",null,"YYYY-MM-DD HH:MM:SS",null,null,"시즌",null,"봄/여름/가을/겨울/Free",null,"할인액","할인구분",null,"정액/정율",null,null,"실판매가격"]
[null,null,"메모등록자",null,"UserID(UserName)",null,null,"성별",null,"남/여/공용",null,null,"할인율/액",null,"(%/액) \n액 의경우 1원단위 가능,  율 의 경우 100% 까지 가능",null,null,"판매가격"]
[null,"공급처 1","공급처 ID",null,"providerNo",null,null,"유통구분",null,"위탁/사입/입점",null,null,"최소구매금액",null,"최대 999,999,999원, 소수점 입력불가/숫자만입력가능",null,null,"수량"]
[null,null,"공급처명",{"$nulls":4},"이월구분",null,"신상 \n이월 : 이월 일 때에 아울렛 노출",null,null,"최대할인금액",null,"최대 999,999,999원, 소수점 입력불가/숫자만입력가능",null,null,"상품총액"]
[null,null,"재고관리구분",null,"사입/위탁/입점/자사/제휴/구매대행",null,null,"과세여부",null,"과세/비과세/면세",null,null,"분담율",null,"100까지만 입력가능, 소수점 입력불가/숫자만입력가능",null,null,"판매총액"]
{"$rows_left_out":104}